{"text_format":"1","workbook":"xlsx","n_sheets":14,"sheets":["Cover","Navigator","Style Guide","Model Parameters","Assumptions","Calculations","Opening Balance Sheet","Income Statement","Balance Sheet","Cash Flow Statement","Lookup","Timing","Error Checks","Change Log"],"not_rendered":{"charts":0,"images":1,"macros":1,"external_links":0,"defined_names":61,"comments":0,"pivot_tables":0},"unopened":[],"bounds":{"document_bytes":16777216,"sheet_cells":100000,"rows_first":2000,"rows_last":500,"rows_between":2000,"halvings":0,"cell_chars":16384,"cell_head_chars":4096},"cells_cut":0,"cells_raw":0,"read":"whole","date_system":"1900"}

{"sheet":"Cover","index":0,"n_rows":21,"n_cols":7,"rows_kept":21,"cut":false,"hidden":false,"merged":[[16,2,16,9],[17,2,17,9],[20,6,20,8]]}
[]
[]
["Navigator"]
[]
[null,null,{"$f":"Client_Name","v":"Go Skills Financial Modeling Training"}]
[null,null,{"$f":"Model_Name","v":"Go Skills Model 47 - Taxation End.xlsm"}]
[]
[]
[]
[]
[]
[]
[]
[null,null,"Primary Developer:  Liam Bastick"]
[]
{"$rows_left_out":7}
{"sheet":"Navigator","index":1,"n_rows":21,"n_cols":7,"rows_kept":21,"cut":false,"hidden":false,"merged":[]}
["Navigator"]
[{"$f":"Model_Name","v":"Go Skills Model 47 - Taxation End.xlsm"}]
["Navigator"]
[null,null,null,null,"Error Checks:",null,{"$f":"Overall_Error_Check","v":0}]
[]
[]
[null,1,"Table of Contents"]
[]
[null,null,null,null,null,"Cover"]
[null,null,null,null,null,"Style Guide"]
[null,null,null,null,null,"Model Parameters"]
[null,null,null,null,null,"Assumptions"]
[null,null,null,null,null,"Calculations"]
[null,null,null,null,null,"Opening Balance Sheet"]
[null,null,null,null,null,"Income Statement"]
{"$rows_left_out":7}
{"sheet":"Style Guide","index":2,"n_rows":74,"n_cols":11,"rows_kept":74,"cut":false,"hidden":false,"merged":[[80,2,80,6],[74,2,74,6],[75,2,75,6],[76,2,76,6],[77,2,77,6],[78,2,78,6],[79,2,79,6],[73,2,73,6],[62,2,62,6],[63,2,63,6],[64,2,64,6],[65,2,65,6],[66,2,66,6],[67,2,67,6],[68,2,68,6],[69,2,69,6],[70,2,70,6],[71,2,71,6],[72,2,72,6],[61,2,61,6],[47,2,47,6],[48,2,48,6],[49,2,49,6],[50,2,50,6],[51,2,51,6],[52,2,52,6],[53,2,53,6],[54,2,54,6],[57,2,57,6],[59,2,59,6],[60,2,60,6],[46,2,46,6],[35,2,35,6],[36,2,36,6],[37,2,37,6],[38,2,38,6],[39,2,39,6],[40,2,40,6],[41,2,41,6],[42,2,42,6],[43,2,43,6],[44,2,44,6],[45,2,45,6],[34,2,34,6],[17,2,17,6],[18,2,18,6],[19,2,19,6],[24,2,24,6],[25,2,25,6],[26,2,26,6],[27,2,27,6],[28,2,28,6],[29,2,29,6],[30,2,30,6],[31,2,31,6],[16,2,16,6],[7,2,7,6],[8,2,8,6],[9,2,9,6],[10,2,10,6],[11,2,11,6],[12,2,12,6],[13,2,13,6],[14,2,14,6],[15,2,15,6]]}
[{"$f":"IF(ISERROR(RIGHT(CELL(\"filename\",A1),LEN(CELL(\"filename\",A1))-FIND(\"]\",CELL(\"filename\",A1)))),\n\"\",\nRIGHT(CELL(\"filename\",A1),LEN(CELL(\"filename\",A1))-FIND(\"]\",CELL(\"filename\",A1))))","v":"Style Guide"}]
[{"$f":"Model_Name","v":"Go Skills Model 47 - Taxation End.xlsm"}]
["Navigator"]
[null,null,null,null,"Error Checks:",null,null,null,{"$f":"Overall_Error_Check","v":0}]
[]
[null,{"$f":"MAX($B$5:$B5)+1","v":1},"Formatting of Headers / Dividers"]
[]
[null,null,"Description",null,null,null,null,null,"Display",null,"Style Name"]
[]
[null,null,"Sheet Title",null,null,null,null,null,{"$f":"C10","v":"Sheet Title"},null,"Sheet Title"]
[null,null,"Model Name",null,null,null,null,null,{"$f":"C11","v":"Model Name"},null,"Model Name"]
[]
[null,null,"Header 1",null,null,null,null,null,{"$f":"C13","v":"Header 1"},null,"Header 1"]
[null,null,"Header 2",null,null,null,null,null,{"$f":"C14","v":"Header 2"},null,"Header 2"]
[null,null,"Header 3",null,null,null,null,null,{"$f":"C15","v":"Header 3"},null,"Header 3"]
{"$rows_left_out":60}
{"sheet":"Model Parameters","index":3,"n_rows":56,"n_cols":9,"rows_kept":56,"cut":false,"hidden":false,"merged":[[0,9,0,10],[10,6,10,13],[11,6,11,13]]}
[{"$f":"IF(ISERROR(RIGHT(CELL(\"filename\",A1),LEN(CELL(\"filename\",A1))-FIND(\"]\",CELL(\"filename\",A1)))),\n\"\",\nRIGHT(CELL(\"filename\",A1),LEN(CELL(\"filename\",A1))-FIND(\"]\",CELL(\"filename\",A1))))","v":"Model Parameters"}]
[{"$f":"Model_Name","v":"Go Skills Model 47 - Taxation End.xlsm"}]
["Navigator"]
[null,null,null,null,"Error Checks:",null,null,null,{"$f":"Overall_Error_Check","v":0}]
[]
[null,{"$f":"MAX($B$5:$B5)+1","v":1},"General"]
[]
[null,null,"Key Inputs"]
[]
[null,null,null,null,"General"]
[null,null,null,null,"Model Name",null,{"$f":"IF(ISERROR(OR(FIND(\"[\",CELL(\"filename\",A1)),FIND(\"]\",CELL(\"filename\",A1)))),\"\",MID(CELL(\"filename\",A1),FIND(\"[\",CELL(\"filename\",A1))+1,FIND(\"]\",CELL(\"filename\",A1))-FIND(\"[\",CELL(\"filename\",A1))-1))","v":"Go Skills Model 47 - Taxation End.xlsm"}]
[null,null,null,null,"Client Name",null,"Go Skills Financial Modeling Training"]
[]
[]
[null,{"$f":"MAX($B$5:$B14)+1","v":2},"General Range Names"]
{"$rows_left_out":42}
{"sheet":"Assumptions","index":4,"n_rows":129,"n_cols":14,"rows_kept":129,"cut":false,"hidden":false,"merged":[]}
[{"$f":"IF(ISERROR(RIGHT(CELL(\"filename\",A1),LEN(CELL(\"filename\",A1))-FIND(\"]\",CELL(\"filename\",A1)))),\n\"\",\nRIGHT(CELL(\"filename\",A1),LEN(CELL(\"filename\",A1))-FIND(\"]\",CELL(\"filename\",A1))))","v":"Assumptions"}]
[{"$f":"Model_Name","v":"Go Skills Model 47 - Taxation End.xlsm"}]
["Navigator"]
[null,"Error Checks:",null,null,null,{"$f":"Overall_Error_Check","v":0}]
[null,null,null,null,null,null,null,null,null,{"$f":"Timing!J5","v":"2020-06-30"},{"$f":"Timing!K5","v":"2021-06-30"},{"$f":"Timing!L5","v":"2022-06-30"},{"$f":"Timing!M5","v":"2023-06-30"},{"$f":"Timing!N5","v":"2024-06-30"}]
[null,null,"Start Date",null,null,null,null,null,null,{"$f":"Timing!J6","v":"2019-07-01"},{"$f":"Timing!K6","v":"2020-07-01"},{"$f":"Timing!L6","v":"2021-07-01"},{"$f":"Timing!M6","v":"2022-07-01"},{"$f":"Timing!N6","v":"2023-07-01"}]
[null,null,"End Date",null,null,null,null,null,null,{"$f":"Timing!J7","v":"2020-06-30"},{"$f":"Timing!K7","v":"2021-06-30"},{"$f":"Timing!L7","v":"2022-06-30"},{"$f":"Timing!M7","v":"2023-06-30"},{"$f":"Timing!N7","v":"2024-06-30"}]
[null,null,"Number of Days",null,null,null,null,null,null,{"$f":"Timing!J8","v":366},{"$f":"Timing!K8","v":365},{"$f":"Timing!L8","v":365},{"$f":"Timing!M8","v":365},{"$f":"Timing!N8","v":366}]
[null,null,"Counter",null,null,null,null,null,null,{"$f":"Timing!J9","v":1},{"$f":"Timing!K9","v":2},{"$f":"Timing!L9","v":3},{"$f":"Timing!M9","v":4},{"$f":"Timing!N9","v":5}]
[]
[null,{"$f":"MAX($B$10:$B10)+1","v":1},{"$f":"A1","v":"Assumptions"}]
[]
[null,null,"Revenue and related"]
[]
[null,null,null,"Sales"]
{"$rows_left_out":115}
{"sheet":"Calculations","index":5,"n_rows":362,"n_cols":15,"rows_kept":362,"cut":false,"hidden":false,"merged":[]}
[{"$f":"IF(ISERROR(RIGHT(CELL(\"filename\",A1),LEN(CELL(\"filename\",A1))-FIND(\"]\",CELL(\"filename\",A1)))),\n\"\",\nRIGHT(CELL(\"filename\",A1),LEN(CELL(\"filename\",A1))-FIND(\"]\",CELL(\"filename\",A1))))","v":"Calculations"}]
[{"$f":"Model_Name","v":"Go Skills Model 47 - Taxation End.xlsm"}]
["Navigator"]
[null,"Error Checks:",null,null,null,{"$f":"Overall_Error_Check","v":0}]
[null,null,null,null,null,null,null,null,null,{"$f":"Timing!J5","v":"2020-06-30"},{"$f":"Timing!K5","v":"2021-06-30"},{"$f":"Timing!L5","v":"2022-06-30"},{"$f":"Timing!M5","v":"2023-06-30"},{"$f":"Timing!N5","v":"2024-06-30"}]
[null,null,"Start Date",null,null,null,null,null,null,{"$f":"Timing!J6","v":"2019-07-01"},{"$f":"Timing!K6","v":"2020-07-01"},{"$f":"Timing!L6","v":"2021-07-01"},{"$f":"Timing!M6","v":"2022-07-01"},{"$f":"Timing!N6","v":"2023-07-01"}]
[null,null,"End Date",null,null,null,null,null,null,{"$f":"Timing!J7","v":"2020-06-30"},{"$f":"Timing!K7","v":"2021-06-30"},{"$f":"Timing!L7","v":"2022-06-30"},{"$f":"Timing!M7","v":"2023-06-30"},{"$f":"Timing!N7","v":"2024-06-30"}]
[null,null,"Number of Days",null,null,null,null,null,null,{"$f":"Timing!J8","v":366},{"$f":"Timing!K8","v":365},{"$f":"Timing!L8","v":365},{"$f":"Timing!M8","v":365},{"$f":"Timing!N8","v":366}]
[null,null,"Counter",null,null,null,null,null,null,{"$f":"Timing!J9","v":1},{"$f":"Timing!K9","v":2},{"$f":"Timing!L9","v":3},{"$f":"Timing!M9","v":4},{"$f":"Timing!N9","v":5}]
[]
[null,{"$f":"MAX($B$10:$B10)+1","v":1},{"$f":"A1","v":"Calculations"}]
[]
[null,null,{"$f":"Assumptions!C13","v":"Revenue and related"}]
[]
[null,null,null,{"$f":"Assumptions!D15","v":"Sales"}]
{"$rows_left_out":348}
{"sheet":"Opening Balance Sheet","index":6,"n_rows":58,"n_cols":11,"rows_kept":58,"cut":false,"hidden":false,"merged":[]}
[{"$f":"IF(ISERROR(RIGHT(CELL(\"filename\",A1),LEN(CELL(\"filename\",A1))-FIND(\"]\",CELL(\"filename\",A1)))),\n\"\",\nRIGHT(CELL(\"filename\",A1),LEN(CELL(\"filename\",A1))-FIND(\"]\",CELL(\"filename\",A1))))","v":"Opening Balance Sheet"}]
[{"$f":"Model_Name","v":"Go Skills Model 47 - Taxation End.xlsm"}]
["Navigator"]
[null,"Error Checks:",null,null,null,{"$f":"Overall_Error_Check","v":0}]
[null,null,null,null,null,null,null,null,null,null,{"$f":"Model_Start_Date-1","v":"2019-06-30"}]
[null,null,"Start Date"]
[null,null,"End Date"]
[null,null,"Number of Days"]
[null,null,"Counter"]
[]
[null,{"$f":"MAX($B$10:$B10)+1","v":1},{"$f":"A1","v":"Opening Balance Sheet"}]
[]
[null,null,"Current assets"]
[null,null,null,"Cash",null,null,{"$f":"Currency","v":"US$'000"},null,null,null,250]
[null,null,null,"Accounts receivable",null,null,{"$f":"Currency","v":"US$'000"},null,null,null,50]
{"$rows_left_out":44}
{"sheet":"Income Statement","index":7,"n_rows":28,"n_cols":14,"rows_kept":28,"cut":false,"hidden":false,"merged":[]}
[{"$f":"IF(ISERROR(RIGHT(CELL(\"filename\",A1),LEN(CELL(\"filename\",A1))-FIND(\"]\",CELL(\"filename\",A1)))),\n\"\",\nRIGHT(CELL(\"filename\",A1),LEN(CELL(\"filename\",A1))-FIND(\"]\",CELL(\"filename\",A1))))","v":"Income Statement"}]
[{"$f":"Model_Name","v":"Go Skills Model 47 - Taxation End.xlsm"}]
["Navigator"]
[null,"Error Checks:",null,null,null,{"$f":"Overall_Error_Check","v":0}]
[null,null,null,null,null,null,null,null,null,{"$f":"Timing!J5","v":"2020-06-30"},{"$f":"Timing!K5","v":"2021-06-30"},{"$f":"Timing!L5","v":"2022-06-30"},{"$f":"Timing!M5","v":"2023-06-30"},{"$f":"Timing!N5","v":"2024-06-30"}]
[null,null,"Start Date",null,null,null,null,null,null,{"$f":"Timing!J6","v":"2019-07-01"},{"$f":"Timing!K6","v":"2020-07-01"},{"$f":"Timing!L6","v":"2021-07-01"},{"$f":"Timing!M6","v":"2022-07-01"},{"$f":"Timing!N6","v":"2023-07-01"}]
[null,null,"End Date",null,null,null,null,null,null,{"$f":"Timing!J7","v":"2020-06-30"},{"$f":"Timing!K7","v":"2021-06-30"},{"$f":"Timing!L7","v":"2022-06-30"},{"$f":"Timing!M7","v":"2023-06-30"},{"$f":"Timing!N7","v":"2024-06-30"}]
[null,null,"Number of Days",null,null,null,null,null,null,{"$f":"Timing!J8","v":366},{"$f":"Timing!K8","v":365},{"$f":"Timing!L8","v":365},{"$f":"Timing!M8","v":365},{"$f":"Timing!N8","v":366}]
[null,null,"Counter",null,null,null,null,null,null,{"$f":"Timing!J9","v":1},{"$f":"Timing!K9","v":2},{"$f":"Timing!L9","v":3},{"$f":"Timing!M9","v":4},{"$f":"Timing!N9","v":5}]
[]
[null,{"$f":"MAX($B$10:$B10)+1","v":1},{"$f":"A1","v":"Income Statement"}]
[]
[null,null,null,"Revenue",null,null,{"$f":"Currency","v":"US$'000"},null,null,{"$f":"Calculations!J36","v":1500},{"$f":"Calculations!K36","v":3090},{"$f":"Calculations!L36","v":4820.4000000000005},{"$f":"Calculations!M36","v":6748.56},{"$f":"Calculations!N36","v":8941.8420000000006}]
[null,null,null,"COGS",null,null,{"$f":"Currency","v":"US$'000"},null,null,{"$f":"-Calculations!J62+Calculations!J137","v":-1248},{"$f":"-Calculations!K62+Calculations!K137","v":-2766.1372549019607},{"$f":"-Calculations!L62+Calculations!L137","v":-3807.6227691618669},{"$f":"-Calculations!M62+Calculations!M137","v":-5292.5070008639059},{"$f":"-Calculations!N62+Calculations!N137","v":-7658.7572502902312}]
[null,null,null,"Gross Profit",null,null,{"$f":"Currency","v":"US$'000"},null,null,{"$f":"SUM(J13:J14)","v":252},{"$f":"SUM(K13:K14)","v":323.86274509803934},1012.7772308381336,1456.0529991360945,1283.0847497097693]
{"$rows_left_out":14}
{"sheet":"Balance Sheet","index":8,"n_rows":58,"n_cols":14,"rows_kept":58,"cut":false,"hidden":false,"merged":[]}
[{"$f":"IF(ISERROR(RIGHT(CELL(\"filename\",A1),LEN(CELL(\"filename\",A1))-FIND(\"]\",CELL(\"filename\",A1)))),\n\"\",\nRIGHT(CELL(\"filename\",A1),LEN(CELL(\"filename\",A1))-FIND(\"]\",CELL(\"filename\",A1))))","v":"Balance Sheet"}]
[{"$f":"Model_Name","v":"Go Skills Model 47 - Taxation End.xlsm"}]
["Navigator"]
[null,"Error Checks:",null,null,null,{"$f":"Overall_Error_Check","v":0}]
[null,null,null,null,null,null,null,null,null,{"$f":"Timing!J5","v":"2020-06-30"},{"$f":"Timing!K5","v":"2021-06-30"},{"$f":"Timing!L5","v":"2022-06-30"},{"$f":"Timing!M5","v":"2023-06-30"},{"$f":"Timing!N5","v":"2024-06-30"}]
[null,null,"Start Date",null,null,null,null,null,null,{"$f":"Timing!J6","v":"2019-07-01"},{"$f":"Timing!K6","v":"2020-07-01"},{"$f":"Timing!L6","v":"2021-07-01"},{"$f":"Timing!M6","v":"2022-07-01"},{"$f":"Timing!N6","v":"2023-07-01"}]
[null,null,"End Date",null,null,null,null,null,null,{"$f":"Timing!J7","v":"2020-06-30"},{"$f":"Timing!K7","v":"2021-06-30"},{"$f":"Timing!L7","v":"2022-06-30"},{"$f":"Timing!M7","v":"2023-06-30"},{"$f":"Timing!N7","v":"2024-06-30"}]
[null,null,"Number of Days",null,null,null,null,null,null,{"$f":"Timing!J8","v":366},{"$f":"Timing!K8","v":365},{"$f":"Timing!L8","v":365},{"$f":"Timing!M8","v":365},{"$f":"Timing!N8","v":366}]
[null,null,"Counter",null,null,null,null,null,null,{"$f":"Timing!J9","v":1},{"$f":"Timing!K9","v":2},{"$f":"Timing!L9","v":3},{"$f":"Timing!M9","v":4},{"$f":"Timing!N9","v":5}]
[]
[null,{"$f":"MAX($B$10:$B10)+1","v":1},{"$f":"A1","v":"Balance Sheet"}]
[]
[null,null,{"$f":"'Opening Balance Sheet'!C13","v":"Current assets"}]
[null,null,null,{"$f":"'Opening Balance Sheet'!D14","v":"Cash"},null,null,{"$f":"Currency","v":"US$'000"},null,null,{"$f":"IF(J$9=1,'Opening Balance Sheet'!$I$14,I14)+'Cash Flow Statement'!J37","v":-740.42622950819668},{"$f":"IF(K$9=1,'Opening Balance Sheet'!$I$14,J14)+'Cash Flow Statement'!K37","v":-2458.6519637448791},{"$f":"IF(L$9=1,'Opening Balance Sheet'!$I$14,K14)+'Cash Flow Statement'!L37","v":-598.44910608418468},{"$f":"IF(M$9=1,'Opening Balance Sheet'!$I$14,L14)+'Cash Flow Statement'!M37","v":1568.4843377702136},{"$f":"IF(N$9=1,'Opening Balance Sheet'!$I$14,M14)+'Cash Flow Statement'!N37","v":2669.5940733128054}]
[null,null,null,{"$f":"'Opening Balance Sheet'!D15","v":"Accounts receivable"},null,null,{"$f":"Currency","v":"US$'000"},null,null,{"$f":"Calculations!J38","v":245.90163934426229},{"$f":"Calculations!K38","v":507.94520547945206},{"$f":"Calculations!L38","v":792.39452054794538},{"$f":"Calculations!M38","v":1109.3523287671235},{"$f":"Calculations!N38","v":1465.875737704918}]
{"$rows_left_out":44}
{"sheet":"Cash Flow Statement","index":9,"n_rows":37,"n_cols":14,"rows_kept":37,"cut":false,"hidden":false,"merged":[]}
[{"$f":"IF(ISERROR(RIGHT(CELL(\"filename\",A1),LEN(CELL(\"filename\",A1))-FIND(\"]\",CELL(\"filename\",A1)))),\n\"\",\nRIGHT(CELL(\"filename\",A1),LEN(CELL(\"filename\",A1))-FIND(\"]\",CELL(\"filename\",A1))))","v":"Cash Flow Statement"}]
[{"$f":"Model_Name","v":"Go Skills Model 47 - Taxation End.xlsm"}]
["Navigator"]
[null,"Error Checks:",null,null,null,null,{"$f":"Overall_Error_Check","v":0}]
[null,null,null,null,null,null,null,null,null,{"$f":"Timing!J5","v":"2020-06-30"},{"$f":"Timing!K5","v":"2021-06-30"},{"$f":"Timing!L5","v":"2022-06-30"},{"$f":"Timing!M5","v":"2023-06-30"},{"$f":"Timing!N5","v":"2024-06-30"}]
[null,null,"Start Date",null,null,null,null,null,null,{"$f":"Timing!J6","v":"2019-07-01"},{"$f":"Timing!K6","v":"2020-07-01"},{"$f":"Timing!L6","v":"2021-07-01"},{"$f":"Timing!M6","v":"2022-07-01"},{"$f":"Timing!N6","v":"2023-07-01"}]
[null,null,"End Date",null,null,null,null,null,null,{"$f":"Timing!J7","v":"2020-06-30"},{"$f":"Timing!K7","v":"2021-06-30"},{"$f":"Timing!L7","v":"2022-06-30"},{"$f":"Timing!M7","v":"2023-06-30"},{"$f":"Timing!N7","v":"2024-06-30"}]
[null,null,"Number of Days",null,null,null,null,null,null,{"$f":"Timing!J8","v":366},{"$f":"Timing!K8","v":365},{"$f":"Timing!L8","v":365},{"$f":"Timing!M8","v":365},{"$f":"Timing!N8","v":366}]
[null,null,"Counter",null,null,null,null,null,null,{"$f":"Timing!J9","v":1},{"$f":"Timing!K9","v":2},{"$f":"Timing!L9","v":3},{"$f":"Timing!M9","v":4},{"$f":"Timing!N9","v":5}]
[]
[null,{"$f":"MAX($B$10:$B10)+1","v":1},{"$f":"A1","v":"Cash Flow Statement"}]
[]
[null,null,"Direct Cash Flow Statement"]
[]
[null,null,null,"Operating cash flow"]
{"$rows_left_out":23}
{"sheet":"Lookup","index":10,"n_rows":15,"n_cols":6,"rows_kept":15,"cut":false,"hidden":false,"merged":[]}
[{"$f":"IF(ISERROR(RIGHT(CELL(\"filename\",A1),LEN(CELL(\"filename\",A1))-FIND(\"]\",CELL(\"filename\",A1)))),\n\"\",\nRIGHT(CELL(\"filename\",A1),LEN(CELL(\"filename\",A1))-FIND(\"]\",CELL(\"filename\",A1))))","v":"Lookup"}]
[{"$f":"Model_Name","v":"Go Skills Model 47 - Taxation End.xlsm"}]
["Navigator"]
[null,"Error Checks:",null,null,null,{"$f":"Overall_Error_Check","v":0}]
[]
[null,{"$f":"MAX($B$5:$B5)+1","v":1},{"$f":"A1","v":"Lookup"}]
[]
[null,null,"Year Lookups"]
[]
[null,null,null,"LU_Future_Years"]
[null,null,null,{"$f":"OFFSET(Timing!$J$7,,ROWS($C$11:$C11))","v":"2021-06-30"},null,"LU_Future_Years"]
[null,null,null,{"$f":"OFFSET(Timing!$J$7,,ROWS($C$11:$C12))","v":"2022-06-30"}]
[null,null,null,{"$f":"OFFSET(Timing!$J$7,,ROWS($C$11:$C13))","v":"2023-06-30"}]
[null,null,null,{"$f":"OFFSET(Timing!$J$7,,ROWS($C$11:$C14))","v":"2024-06-30"}]
[null,null,null,"Actuals Throughout"]
{"$rows_left_out":1}
{"sheet":"Timing","index":11,"n_rows":23,"n_cols":14,"rows_kept":23,"cut":false,"hidden":false,"merged":[]}
[{"$f":"IF(ISERROR(RIGHT(CELL(\"filename\",A1),LEN(CELL(\"filename\",A1))-FIND(\"]\",CELL(\"filename\",A1)))),\n\"\",\nRIGHT(CELL(\"filename\",A1),LEN(CELL(\"filename\",A1))-FIND(\"]\",CELL(\"filename\",A1))))","v":"Timing"}]
[{"$f":"Model_Name","v":"Go Skills Model 47 - Taxation End.xlsm"}]
["Navigator"]
[null,"Error Checks:",null,null,null,{"$f":"Overall_Error_Check","v":0}]
[null,null,null,null,null,null,null,null,null,{"$f":"J7","v":"2020-06-30"},{"$f":"K7","v":"2021-06-30"},"2022-06-30","2023-06-30","2024-06-30"]
[null,null,"Start Date",null,null,null,null,null,null,{"$f":"IF(J$9=1,Model_Start_Date,I7+1)","v":"2019-07-01"},{"$f":"IF(K$9=1,Model_Start_Date,J7+1)","v":"2020-07-01"},{"$f":"IF(L$9=1,Model_Start_Date,K7+1)","v":"2021-07-01"},{"$f":"IF(M$9=1,Model_Start_Date,L7+1)","v":"2022-07-01"},{"$f":"IF(N$9=1,Model_Start_Date,M7+1)","v":"2023-07-01"}]
[null,null,"End Date",null,null,null,null,null,null,{"$f":"EOMONTH(J$6,MOD(Periodicity+Reporting_Month_Factor-MONTH(J$6),Periodicity))","v":"2020-06-30"},{"$f":"EOMONTH(K$6,MOD(Periodicity+Reporting_Month_Factor-MONTH(K$6),Periodicity))","v":"2021-06-30"},{"$f":"EOMONTH(L$6,MOD(Periodicity+Reporting_Month_Factor-MONTH(L$6),Periodicity))","v":"2022-06-30"},{"$f":"EOMONTH(M$6,MOD(Periodicity+Reporting_Month_Factor-MONTH(M$6),Periodicity))","v":"2023-06-30"},{"$f":"EOMONTH(N$6,MOD(Periodicity+Reporting_Month_Factor-MONTH(N$6),Periodicity))","v":"2024-06-30"}]
[null,null,"Number of Days",null,null,null,null,null,null,{"$f":"J7-J6+1","v":366},{"$f":"K7-K6+1","v":365},365,365,366]
[null,null,"Counter",null,null,null,null,null,null,{"$f":"N(I9)+1","v":1},{"$f":"N(J9)+1","v":2},3,4,5]
[]
[null,{"$f":"MAX($B$10:$B10)+1","v":1},"Timing Assumptions"]
[]
[null,null,"Data (do not change once modelling has commenced)"]
[]
[null,null,null,"Model Start Date",null,null,null,"2019-07-01"]
{"$rows_left_out":9}
{"sheet":"Error Checks","index":12,"n_rows":25,"n_cols":9,"rows_kept":25,"cut":false,"hidden":false,"merged":[[0,8,0,9]]}
[{"$f":"IF(ISERROR(RIGHT(CELL(\"filename\",A1),LEN(CELL(\"filename\",A1))-FIND(\"]\",CELL(\"filename\",A1)))),\n\"\",\nRIGHT(CELL(\"filename\",A1),LEN(CELL(\"filename\",A1))-FIND(\"]\",CELL(\"filename\",A1))))","v":"Error Checks"}]
[{"$f":"Model_Name","v":"Go Skills Model 47 - Taxation End.xlsm"}]
["Navigator"]
[null,"Error Checks:",null,null,null,{"$f":"Overall_Error_Check","v":0}]
[]
[null,{"$f":"MAX($B$5:$B5)+1","v":1},"Error Checks"]
[]
[null,null,"Summary of Errors"]
[]
[null,null,null,"Assumptions"]
[]
[null,null,null,null,"Balance Sheet has no errors",null,null,null,{"$f":"HL_BS_Errors","v":0}]
[null,null,null,null,"Balance Sheet balances",null,null,null,{"$f":"HL_BS_Balance","v":0}]
[null,null,null,null,"Insolvency Check for Balance Sheet",null,null,null,{"$f":"HL_BS_Insolvency","v":0}]
[null,null,null,null,"Opening Balance Sheet has no errors",null,null,null,{"$f":"HL_Op_BS_Errors","v":0}]
{"$rows_left_out":11}
{"sheet":"Change Log","index":13,"n_rows":13,"n_cols":11,"rows_kept":13,"cut":false,"hidden":false,"merged":[]}
[{"$f":"IF(ISERROR(RIGHT(CELL(\"filename\",A1),LEN(CELL(\"filename\",A1))-FIND(\"]\",CELL(\"filename\",A1)))),\n\"\",\nRIGHT(CELL(\"filename\",A1),LEN(CELL(\"filename\",A1))-FIND(\"]\",CELL(\"filename\",A1))))","v":"Change Log"}]
[{"$f":"Model_Name","v":"Go Skills Model 47 - Taxation End.xlsm"}]
["Navigator"]
[null,"Error Checks:",null,null,null,{"$f":"Overall_Error_Check","v":0}]
[]
[null,{"$f":"MAX($B$5:$B5)+1","v":1},{"$f":"A1","v":"Change Log"}]
[]
[null,null,"Summary"]
[]
[null,null,null,null,null,"Date","Model Version ","Details of change","Worksheet Reference","Row, column, cell reference","Author"]
[null,null,null,null,null,"2019-07-01","Version LB1.01","I changed it","Change Log","J11","LB"]
[null,null,null,null,null,"2019-07-01","Version LB1.02","So did I.","Error Checks","I12","LB"]
[null,null,null,null,null,"2019-07-01","Version LB1.03","And me.","Navigator","A1","Dave"]