{"text_format":"1","workbook":"xlsx","n_sheets":13,"sheets":["Cover","Navigator","Style Guide","Model Parameters","Assumptions","Calculations","Opening Balance Sheet","Income Statement","Balance Sheet","Cash Flow Statement","Timing","Error Checks","Change Log"],"not_rendered":{"charts":0,"images":1,"macros":1,"external_links":0,"defined_names":58,"comments":0,"pivot_tables":0},"unopened":[],"bounds":{"document_bytes":16777216,"sheet_cells":100000,"rows_first":2000,"rows_last":500,"rows_between":2000,"halvings":0,"cell_chars":16384,"cell_head_chars":4096},"cells_cut":0,"cells_raw":0,"read":"whole","date_system":"1900"}

{"sheet":"Cover","index":0,"n_rows":21,"n_cols":7,"rows_kept":21,"cut":false,"hidden":false,"merged":[[16,2,16,9],[17,2,17,9],[20,6,20,8]]}
[]
[]
["Navigator"]
[]
[null,null,{"$f":"Client_Name","v":"Go Skills Financial Modeling Training"}]
[null,null,{"$f":"Model_Name","v":"Go Skills Model 22 - Revenue Part 2 End.xlsm"}]
[]
[]
[]
[]
[]
[]
[]
[null,null,"Primary Developer:  Liam Bastick"]
[]
[null,null,"General Cover Notes:"]
[null,null,"Financial Model for Training Course."]
[]
[]
[]
{"$rows_left_out":2}
{"sheet":"Navigator","index":1,"n_rows":20,"n_cols":7,"rows_kept":20,"cut":false,"hidden":false,"merged":[]}
["Navigator"]
[{"$f":"Model_Name","v":"Go Skills Model 22 - Revenue Part 2 End.xlsm"}]
["Navigator"]
[null,null,null,null,"Error Checks:",null,{"$f":"Overall_Error_Check","v":0}]
[]
[]
[null,1,"Table of Contents"]
[]
[null,null,null,null,null,"Cover"]
[null,null,null,null,null,"Style Guide"]
[null,null,null,null,null,"Model Parameters"]
[null,null,null,null,null,"Assumptions"]
[null,null,null,null,null,"Calculations"]
[null,null,null,null,null,"Opening Balance Sheet"]
[null,null,null,null,null,"Income Statement"]
[null,null,null,null,null,"Balance Sheet"]
[null,null,null,null,null,"Cash Flow Statement"]
[null,null,null,null,null,"Timing"]
[null,null,null,null,null,"Error Checks"]
[null,null,null,null,null,"Change Log"]
{"$rows_left_out":1}
{"sheet":"Style Guide","index":2,"n_rows":74,"n_cols":11,"rows_kept":74,"cut":false,"hidden":false,"merged":[[16,2,16,6],[7,2,7,6],[8,2,8,6],[9,2,9,6],[10,2,10,6],[11,2,11,6],[12,2,12,6],[13,2,13,6],[14,2,14,6],[15,2,15,6],[34,2,34,6],[17,2,17,6],[18,2,18,6],[19,2,19,6],[24,2,24,6],[25,2,25,6],[26,2,26,6],[27,2,27,6],[28,2,28,6],[29,2,29,6],[30,2,30,6],[31,2,31,6],[46,2,46,6],[35,2,35,6],[36,2,36,6],[37,2,37,6],[38,2,38,6],[39,2,39,6],[40,2,40,6],[41,2,41,6],[42,2,42,6],[43,2,43,6],[44,2,44,6],[45,2,45,6],[61,2,61,6],[47,2,47,6],[48,2,48,6],[49,2,49,6],[50,2,50,6],[51,2,51,6],[52,2,52,6],[53,2,53,6],[54,2,54,6],[57,2,57,6],[59,2,59,6],[60,2,60,6],[73,2,73,6],[62,2,62,6],[63,2,63,6],[64,2,64,6],[65,2,65,6],[66,2,66,6],[67,2,67,6],[68,2,68,6],[69,2,69,6],[70,2,70,6],[71,2,71,6],[72,2,72,6],[80,2,80,6],[74,2,74,6],[75,2,75,6],[76,2,76,6],[77,2,77,6],[78,2,78,6],[79,2,79,6]]}
[{"$f":"IF(ISERROR(RIGHT(CELL(\"filename\",A1),LEN(CELL(\"filename\",A1))-FIND(\"]\",CELL(\"filename\",A1)))),\n\"\",\nRIGHT(CELL(\"filename\",A1),LEN(CELL(\"filename\",A1))-FIND(\"]\",CELL(\"filename\",A1))))","v":"Style Guide"}]
[{"$f":"Model_Name","v":"Go Skills Model 22 - Revenue Part 2 End.xlsm"}]
["Navigator"]
[null,null,null,null,"Error Checks:",null,null,null,{"$f":"Overall_Error_Check","v":0}]
[]
[null,{"$f":"MAX($B$5:$B5)+1","v":1},"Formatting of Headers / Dividers"]
[]
[null,null,"Description",null,null,null,null,null,"Display",null,"Style Name"]
[]
[null,null,"Sheet Title",null,null,null,null,null,{"$f":"C10","v":"Sheet Title"},null,"Sheet Title"]
[null,null,"Model Name",null,null,null,null,null,{"$f":"C11","v":"Model Name"},null,"Model Name"]
[]
[null,null,"Header 1",null,null,null,null,null,{"$f":"C13","v":"Header 1"},null,"Header 1"]
[null,null,"Header 2",null,null,null,null,null,{"$f":"C14","v":"Header 2"},null,"Header 2"]
[null,null,"Header 3",null,null,null,null,null,{"$f":"C15","v":"Header 3"},null,"Header 3"]
[null,null,"Header 4",null,null,null,null,null,{"$f":"C16","v":"Header 4"},null,"Header 4"]
[]
[null,null,"Notes",null,null,null,null,null,{"$f":"C18","v":"Notes"},null,"Notes"]
[]
[null,null,"Table Heading",null,null,null,null,null,{"$f":"C20","v":"Table Heading"},null,"Table Heading"]
{"$rows_left_out":55}
{"sheet":"Model Parameters","index":3,"n_rows":56,"n_cols":9,"rows_kept":56,"cut":false,"hidden":false,"merged":[[0,9,0,10],[10,6,10,13],[11,6,11,13]]}
[{"$f":"IF(ISERROR(RIGHT(CELL(\"filename\",A1),LEN(CELL(\"filename\",A1))-FIND(\"]\",CELL(\"filename\",A1)))),\n\"\",\nRIGHT(CELL(\"filename\",A1),LEN(CELL(\"filename\",A1))-FIND(\"]\",CELL(\"filename\",A1))))","v":"Model Parameters"}]
[{"$f":"Model_Name","v":"Go Skills Model 22 - Revenue Part 2 End.xlsm"}]
["Navigator"]
[null,null,null,null,"Error Checks:",null,null,null,{"$f":"Overall_Error_Check","v":0}]
[]
[null,{"$f":"MAX($B$5:$B5)+1","v":1},"General"]
[]
[null,null,"Key Inputs"]
[]
[null,null,null,null,"General"]
[null,null,null,null,"Model Name",null,{"$f":"IF(ISERROR(OR(FIND(\"[\",CELL(\"filename\",A1)),FIND(\"]\",CELL(\"filename\",A1)))),\"\",MID(CELL(\"filename\",A1),FIND(\"[\",CELL(\"filename\",A1))+1,FIND(\"]\",CELL(\"filename\",A1))-FIND(\"[\",CELL(\"filename\",A1))-1))","v":"Go Skills Model 22 - Revenue Part 2 End.xlsm"}]
[null,null,null,null,"Client Name",null,"Go Skills Financial Modeling Training"]
[]
[]
[null,{"$f":"MAX($B$5:$B14)+1","v":2},"General Range Names"]
[]
[null,null,"Technical Assumptions"]
[]
[null,null,null,null,"Days in Year",null,365,null,"Days_in_Year"]
[null,null,null,null,"Months in Month",null,1,null,"Months_in_Month"]
{"$rows_left_out":37}
{"sheet":"Assumptions","index":4,"n_rows":23,"n_cols":14,"rows_kept":23,"cut":false,"hidden":false,"merged":[]}
[{"$f":"IF(ISERROR(RIGHT(CELL(\"filename\",A1),LEN(CELL(\"filename\",A1))-FIND(\"]\",CELL(\"filename\",A1)))),\n\"\",\nRIGHT(CELL(\"filename\",A1),LEN(CELL(\"filename\",A1))-FIND(\"]\",CELL(\"filename\",A1))))","v":"Assumptions"}]
[{"$f":"Model_Name","v":"Go Skills Model 22 - Revenue Part 2 End.xlsm"}]
["Navigator"]
[null,"Error Checks:",null,null,null,{"$f":"Overall_Error_Check","v":0}]
[null,null,null,null,null,null,null,null,null,{"$f":"Timing!J5","v":"2020-06-30"},{"$f":"Timing!K5","v":"2021-06-30"},{"$f":"Timing!L5","v":"2022-06-30"},{"$f":"Timing!M5","v":"2023-06-30"},{"$f":"Timing!N5","v":"2024-06-30"}]
[null,null,"Start Date",null,null,null,null,null,null,{"$f":"Timing!J6","v":"2019-07-01"},{"$f":"Timing!K6","v":"2020-07-01"},{"$f":"Timing!L6","v":"2021-07-01"},{"$f":"Timing!M6","v":"2022-07-01"},{"$f":"Timing!N6","v":"2023-07-01"}]
[null,null,"End Date",null,null,null,null,null,null,{"$f":"Timing!J7","v":"2020-06-30"},{"$f":"Timing!K7","v":"2021-06-30"},{"$f":"Timing!L7","v":"2022-06-30"},{"$f":"Timing!M7","v":"2023-06-30"},{"$f":"Timing!N7","v":"2024-06-30"}]
[null,null,"Number of Days",null,null,null,null,null,null,{"$f":"Timing!J8","v":366},{"$f":"Timing!K8","v":365},{"$f":"Timing!L8","v":365},{"$f":"Timing!M8","v":365},{"$f":"Timing!N8","v":366}]
[null,null,"Counter",null,null,null,null,null,null,{"$f":"Timing!J9","v":1},{"$f":"Timing!K9","v":2},{"$f":"Timing!L9","v":3},{"$f":"Timing!M9","v":4},{"$f":"Timing!N9","v":5}]
[]
[null,{"$f":"MAX($B$10:$B10)+1","v":1},{"$f":"A1","v":"Assumptions"}]
[]
[null,null,"Revenue and related"]
[]
[null,null,null,"Sales"]
[]
[null,null,null,null,"Projected sales",null,{"$f":"Unit","v":"#"},null,null,100,200,300,400,500]
[null,null,null,null,"Unit price",null,{"$f":"Currency","v":"US$'000"},null,null,15]
[null,null,null,null,"Inflation",null,{"$f":"Percentage","v":"%"},null,null,null,0.03,0.04,0.05,0.06]
[]
{"$rows_left_out":4}
{"sheet":"Calculations","index":5,"n_rows":38,"n_cols":15,"rows_kept":38,"cut":false,"hidden":false,"merged":[]}
[{"$f":"IF(ISERROR(RIGHT(CELL(\"filename\",A1),LEN(CELL(\"filename\",A1))-FIND(\"]\",CELL(\"filename\",A1)))),\n\"\",\nRIGHT(CELL(\"filename\",A1),LEN(CELL(\"filename\",A1))-FIND(\"]\",CELL(\"filename\",A1))))","v":"Calculations"}]
[{"$f":"Model_Name","v":"Go Skills Model 22 - Revenue Part 2 End.xlsm"}]
["Navigator"]
[null,"Error Checks:",null,null,null,{"$f":"Overall_Error_Check","v":0}]
[null,null,null,null,null,null,null,null,null,{"$f":"Timing!J5","v":"2020-06-30"},{"$f":"Timing!K5","v":"2021-06-30"},{"$f":"Timing!L5","v":"2022-06-30"},{"$f":"Timing!M5","v":"2023-06-30"},{"$f":"Timing!N5","v":"2024-06-30"}]
[null,null,"Start Date",null,null,null,null,null,null,{"$f":"Timing!J6","v":"2019-07-01"},{"$f":"Timing!K6","v":"2020-07-01"},{"$f":"Timing!L6","v":"2021-07-01"},{"$f":"Timing!M6","v":"2022-07-01"},{"$f":"Timing!N6","v":"2023-07-01"}]
[null,null,"End Date",null,null,null,null,null,null,{"$f":"Timing!J7","v":"2020-06-30"},{"$f":"Timing!K7","v":"2021-06-30"},{"$f":"Timing!L7","v":"2022-06-30"},{"$f":"Timing!M7","v":"2023-06-30"},{"$f":"Timing!N7","v":"2024-06-30"}]
[null,null,"Number of Days",null,null,null,null,null,null,{"$f":"Timing!J8","v":366},{"$f":"Timing!K8","v":365},{"$f":"Timing!L8","v":365},{"$f":"Timing!M8","v":365},{"$f":"Timing!N8","v":366}]
[null,null,"Counter",null,null,null,null,null,null,{"$f":"Timing!J9","v":1},{"$f":"Timing!K9","v":2},{"$f":"Timing!L9","v":3},{"$f":"Timing!M9","v":4},{"$f":"Timing!N9","v":5}]
[]
[null,{"$f":"MAX($B$10:$B10)+1","v":1},{"$f":"A1","v":"Calculations"}]
[]
[null,null,{"$f":"Assumptions!C13","v":"Revenue and related"}]
[]
[null,null,null,{"$f":"Assumptions!D15","v":"Sales"}]
[]
[null,null,null,null,{"$f":"Assumptions!E17","v":"Projected sales"},null,{"$f":"Unit","v":"#"},null,null,{"$f":"Assumptions!J17","v":100},{"$f":"Assumptions!K17","v":200},{"$f":"Assumptions!L17","v":300},{"$f":"Assumptions!M17","v":400},{"$f":"Assumptions!N17","v":500}]
[null,null,null,null,{"$f":"Assumptions!E18","v":"Unit price"},null,{"$f":"Currency","v":"US$'000"},null,null,{"$f":"Assumptions!J18","v":15}]
[null,null,null,null,{"$f":"Assumptions!E19","v":"Inflation"},null,{"$f":"Percentage","v":"%"},null,null,null,{"$f":"Assumptions!K19","v":0.03},{"$f":"Assumptions!L19","v":0.04},{"$f":"Assumptions!M19","v":0.05},{"$f":"Assumptions!N19","v":0.06}]
[]
{"$rows_left_out":19}
{"sheet":"Opening Balance Sheet","index":6,"n_rows":58,"n_cols":11,"rows_kept":58,"cut":false,"hidden":false,"merged":[]}
[{"$f":"IF(ISERROR(RIGHT(CELL(\"filename\",A1),LEN(CELL(\"filename\",A1))-FIND(\"]\",CELL(\"filename\",A1)))),\n\"\",\nRIGHT(CELL(\"filename\",A1),LEN(CELL(\"filename\",A1))-FIND(\"]\",CELL(\"filename\",A1))))","v":"Opening Balance Sheet"}]
[{"$f":"Model_Name","v":"Go Skills Model 22 - Revenue Part 2 End.xlsm"}]
["Navigator"]
[null,"Error Checks:",null,null,null,{"$f":"Overall_Error_Check","v":0}]
[null,null,null,null,null,null,null,null,null,null,{"$f":"Model_Start_Date-1","v":"2019-06-30"}]
[null,null,"Start Date"]
[null,null,"End Date"]
[null,null,"Number of Days"]
[null,null,"Counter"]
[]
[null,{"$f":"MAX($B$10:$B10)+1","v":1},{"$f":"A1","v":"Opening Balance Sheet"}]
[]
[null,null,"Current assets"]
[null,null,null,"Cash",null,null,{"$f":"Currency","v":"US$'000"},null,null,null,250]
[null,null,null,"Accounts receivable",null,null,{"$f":"Currency","v":"US$'000"},null,null,null,50]
[null,null,null,"Inventory",null,null,{"$f":"Currency","v":"US$'000"},null,null,null,0]
[null,null,null,"Other current assets",null,null,{"$f":"Currency","v":"US$'000"},null,null,null,10]
[null,null,null,"Total current assets",null,null,{"$f":"Currency","v":"US$'000"},null,null,null,{"$f":"SUM(K14:K17)","v":310}]
[]
[null,null,"Non-current assets"]
{"$rows_left_out":39}
{"sheet":"Income Statement","index":7,"n_rows":28,"n_cols":14,"rows_kept":28,"cut":false,"hidden":false,"merged":[]}
[{"$f":"IF(ISERROR(RIGHT(CELL(\"filename\",A1),LEN(CELL(\"filename\",A1))-FIND(\"]\",CELL(\"filename\",A1)))),\n\"\",\nRIGHT(CELL(\"filename\",A1),LEN(CELL(\"filename\",A1))-FIND(\"]\",CELL(\"filename\",A1))))","v":"Income Statement"}]
[{"$f":"Model_Name","v":"Go Skills Model 22 - Revenue Part 2 End.xlsm"}]
["Navigator"]
[null,"Error Checks:",null,null,null,{"$f":"Overall_Error_Check","v":0}]
[null,null,null,null,null,null,null,null,null,{"$f":"Timing!J5","v":"2020-06-30"},{"$f":"Timing!K5","v":"2021-06-30"},{"$f":"Timing!L5","v":"2022-06-30"},{"$f":"Timing!M5","v":"2023-06-30"},{"$f":"Timing!N5","v":"2024-06-30"}]
[null,null,"Start Date",null,null,null,null,null,null,{"$f":"Timing!J6","v":"2019-07-01"},{"$f":"Timing!K6","v":"2020-07-01"},{"$f":"Timing!L6","v":"2021-07-01"},{"$f":"Timing!M6","v":"2022-07-01"},{"$f":"Timing!N6","v":"2023-07-01"}]
[null,null,"End Date",null,null,null,null,null,null,{"$f":"Timing!J7","v":"2020-06-30"},{"$f":"Timing!K7","v":"2021-06-30"},{"$f":"Timing!L7","v":"2022-06-30"},{"$f":"Timing!M7","v":"2023-06-30"},{"$f":"Timing!N7","v":"2024-06-30"}]
[null,null,"Number of Days",null,null,null,null,null,null,{"$f":"Timing!J8","v":366},{"$f":"Timing!K8","v":365},{"$f":"Timing!L8","v":365},{"$f":"Timing!M8","v":365},{"$f":"Timing!N8","v":366}]
[null,null,"Counter",null,null,null,null,null,null,{"$f":"Timing!J9","v":1},{"$f":"Timing!K9","v":2},{"$f":"Timing!L9","v":3},{"$f":"Timing!M9","v":4},{"$f":"Timing!N9","v":5}]
[]
[null,{"$f":"MAX($B$10:$B10)+1","v":1},{"$f":"A1","v":"Income Statement"}]
[]
[null,null,null,"Revenue",null,null,{"$f":"Currency","v":"US$'000"},null,null,{"$f":"Calculations!J36","v":1500},{"$f":"Calculations!K36","v":3090},{"$f":"Calculations!L36","v":4820.4000000000005},{"$f":"Calculations!M36","v":6748.56},{"$f":"Calculations!N36","v":8941.8420000000006}]
[null,null,null,"COGS",null,null,{"$f":"Currency","v":"US$'000"}]
[null,null,null,"Gross Profit",null,null,{"$f":"Currency","v":"US$'000"},null,null,{"$f":"SUM(J13:J14)","v":1500},{"$f":"SUM(K13:K14)","v":3090},4820.4000000000005,6748.56,8941.8420000000006]
[]
[null,null,null,"Wastage",null,null,{"$f":"Currency","v":"US$'000"}]
[null,null,null,"Operating expenditure",null,null,{"$f":"Currency","v":"US$'000"}]
[null,null,null,"EBITDA",null,null,{"$f":"Currency","v":"US$'000"},null,null,{"$f":"SUM(J15,J17:J18)","v":1500},{"$f":"SUM(K15,K17:K18)","v":3090},4820.4000000000005,6748.56,8941.8420000000006]
[]
{"$rows_left_out":9}
{"sheet":"Balance Sheet","index":8,"n_rows":58,"n_cols":14,"rows_kept":58,"cut":false,"hidden":false,"merged":[]}
[{"$f":"IF(ISERROR(RIGHT(CELL(\"filename\",A1),LEN(CELL(\"filename\",A1))-FIND(\"]\",CELL(\"filename\",A1)))),\n\"\",\nRIGHT(CELL(\"filename\",A1),LEN(CELL(\"filename\",A1))-FIND(\"]\",CELL(\"filename\",A1))))","v":"Balance Sheet"}]
[{"$f":"Model_Name","v":"Go Skills Model 22 - Revenue Part 2 End.xlsm"}]
["Navigator"]
[null,"Error Checks:",null,null,null,{"$f":"Overall_Error_Check","v":0}]
[null,null,null,null,null,null,null,null,null,{"$f":"Timing!J5","v":"2020-06-30"},{"$f":"Timing!K5","v":"2021-06-30"},{"$f":"Timing!L5","v":"2022-06-30"},{"$f":"Timing!M5","v":"2023-06-30"},{"$f":"Timing!N5","v":"2024-06-30"}]
[null,null,"Start Date",null,null,null,null,null,null,{"$f":"Timing!J6","v":"2019-07-01"},{"$f":"Timing!K6","v":"2020-07-01"},{"$f":"Timing!L6","v":"2021-07-01"},{"$f":"Timing!M6","v":"2022-07-01"},{"$f":"Timing!N6","v":"2023-07-01"}]
[null,null,"End Date",null,null,null,null,null,null,{"$f":"Timing!J7","v":"2020-06-30"},{"$f":"Timing!K7","v":"2021-06-30"},{"$f":"Timing!L7","v":"2022-06-30"},{"$f":"Timing!M7","v":"2023-06-30"},{"$f":"Timing!N7","v":"2024-06-30"}]
[null,null,"Number of Days",null,null,null,null,null,null,{"$f":"Timing!J8","v":366},{"$f":"Timing!K8","v":365},{"$f":"Timing!L8","v":365},{"$f":"Timing!M8","v":365},{"$f":"Timing!N8","v":366}]
[null,null,"Counter",null,null,null,null,null,null,{"$f":"Timing!J9","v":1},{"$f":"Timing!K9","v":2},{"$f":"Timing!L9","v":3},{"$f":"Timing!M9","v":4},{"$f":"Timing!N9","v":5}]
[]
[null,{"$f":"MAX($B$10:$B10)+1","v":1},{"$f":"A1","v":"Balance Sheet"}]
[]
[null,null,{"$f":"'Opening Balance Sheet'!C13","v":"Current assets"}]
[null,null,null,{"$f":"'Opening Balance Sheet'!D14","v":"Cash"},null,null,{"$f":"Currency","v":"US$'000"},null,null,{"$f":"IF(J$9=1,'Opening Balance Sheet'!$I$14,I14)+'Cash Flow Statement'!J37","v":1254.0983606557377},{"$f":"IF(K$9=1,'Opening Balance Sheet'!$I$14,J14)+'Cash Flow Statement'!K37","v":4082.0547945205481},{"$f":"IF(L$9=1,'Opening Balance Sheet'!$I$14,K14)+'Cash Flow Statement'!L37","v":8618.0054794520547},{"$f":"IF(M$9=1,'Opening Balance Sheet'!$I$14,L14)+'Cash Flow Statement'!M37","v":15049.607671232878},{"$f":"IF(N$9=1,'Opening Balance Sheet'!$I$14,M14)+'Cash Flow Statement'!N37","v":23634.926262295085}]
[null,null,null,{"$f":"'Opening Balance Sheet'!D15","v":"Accounts receivable"},null,null,{"$f":"Currency","v":"US$'000"},null,null,{"$f":"Calculations!J38","v":245.90163934426229},{"$f":"Calculations!K38","v":507.94520547945206},{"$f":"Calculations!L38","v":792.39452054794538},{"$f":"Calculations!M38","v":1109.3523287671235},{"$f":"Calculations!N38","v":1465.875737704918}]
[null,null,null,{"$f":"'Opening Balance Sheet'!D16","v":"Inventory"},null,null,{"$f":"Currency","v":"US$'000"}]
[null,null,null,{"$f":"'Opening Balance Sheet'!D17","v":"Other current assets"},null,null,{"$f":"Currency","v":"US$'000"}]
[null,null,null,{"$f":"'Opening Balance Sheet'!D18","v":"Total current assets"},null,null,{"$f":"Currency","v":"US$'000"},null,null,{"$f":"SUM(J14:J17)","v":1500},{"$f":"SUM(K14:K17)","v":4590},{"$f":"SUM(L14:L17)","v":9410.4},{"$f":"SUM(M14:M17)","v":16158.960000000001},{"$f":"SUM(N14:N17)","v":25100.802000000003}]
[]
[null,null,{"$f":"'Opening Balance Sheet'!C20","v":"Non-current assets"}]
{"$rows_left_out":39}
{"sheet":"Cash Flow Statement","index":9,"n_rows":37,"n_cols":14,"rows_kept":37,"cut":false,"hidden":false,"merged":[]}
[{"$f":"IF(ISERROR(RIGHT(CELL(\"filename\",A1),LEN(CELL(\"filename\",A1))-FIND(\"]\",CELL(\"filename\",A1)))),\n\"\",\nRIGHT(CELL(\"filename\",A1),LEN(CELL(\"filename\",A1))-FIND(\"]\",CELL(\"filename\",A1))))","v":"Cash Flow Statement"}]
[{"$f":"Model_Name","v":"Go Skills Model 22 - Revenue Part 2 End.xlsm"}]
["Navigator"]
[null,"Error Checks:",null,null,null,null,{"$f":"Overall_Error_Check","v":0}]
[null,null,null,null,null,null,null,null,null,{"$f":"Timing!J5","v":"2020-06-30"},{"$f":"Timing!K5","v":"2021-06-30"},{"$f":"Timing!L5","v":"2022-06-30"},{"$f":"Timing!M5","v":"2023-06-30"},{"$f":"Timing!N5","v":"2024-06-30"}]
[null,null,"Start Date",null,null,null,null,null,null,{"$f":"Timing!J6","v":"2019-07-01"},{"$f":"Timing!K6","v":"2020-07-01"},{"$f":"Timing!L6","v":"2021-07-01"},{"$f":"Timing!M6","v":"2022-07-01"},{"$f":"Timing!N6","v":"2023-07-01"}]
[null,null,"End Date",null,null,null,null,null,null,{"$f":"Timing!J7","v":"2020-06-30"},{"$f":"Timing!K7","v":"2021-06-30"},{"$f":"Timing!L7","v":"2022-06-30"},{"$f":"Timing!M7","v":"2023-06-30"},{"$f":"Timing!N7","v":"2024-06-30"}]
[null,null,"Number of Days",null,null,null,null,null,null,{"$f":"Timing!J8","v":366},{"$f":"Timing!K8","v":365},{"$f":"Timing!L8","v":365},{"$f":"Timing!M8","v":365},{"$f":"Timing!N8","v":366}]
[null,null,"Counter",null,null,null,null,null,null,{"$f":"Timing!J9","v":1},{"$f":"Timing!K9","v":2},{"$f":"Timing!L9","v":3},{"$f":"Timing!M9","v":4},{"$f":"Timing!N9","v":5}]
[]
[null,{"$f":"MAX($B$10:$B10)+1","v":1},{"$f":"A1","v":"Cash Flow Statement"}]
[]
[null,null,"Direct Cash Flow Statement"]
[]
[null,null,null,"Operating cash flow"]
[null,null,null,null,"Cash receipts",null,{"$f":"Currency","v":"US$'000"},null,null,{"$f":"-Calculations!J37","v":1254.0983606557377},{"$f":"-Calculations!K37","v":2827.9564338648102},{"$f":"-Calculations!L37","v":4535.9506849315076},{"$f":"-Calculations!M37","v":6431.602191780823},{"$f":"-Calculations!N37","v":8585.3185910622051}]
[null,null,null,null,null,"Direct cash payments","US$'000"]
[null,null,null,null,null,"Indirect cash payments","US$'000"]
[null,null,null,null,"Cash payments",null,"US$'000",null,null,{"$f":"SUM(J17:J18)","v":0},{"$f":"SUM(K17:K18)","v":0},0,0,0]
[null,null,null,null,"Interest paid",null,"US$'000"]
{"$rows_left_out":18}
{"sheet":"Timing","index":10,"n_rows":23,"n_cols":14,"rows_kept":23,"cut":false,"hidden":false,"merged":[]}
[{"$f":"IF(ISERROR(RIGHT(CELL(\"filename\",A1),LEN(CELL(\"filename\",A1))-FIND(\"]\",CELL(\"filename\",A1)))),\n\"\",\nRIGHT(CELL(\"filename\",A1),LEN(CELL(\"filename\",A1))-FIND(\"]\",CELL(\"filename\",A1))))","v":"Timing"}]
[{"$f":"Model_Name","v":"Go Skills Model 22 - Revenue Part 2 End.xlsm"}]
["Navigator"]
[null,"Error Checks:",null,null,null,{"$f":"Overall_Error_Check","v":0}]
[null,null,null,null,null,null,null,null,null,{"$f":"J7","v":"2020-06-30"},{"$f":"K7","v":"2021-06-30"},"2022-06-30","2023-06-30","2024-06-30"]
[null,null,"Start Date",null,null,null,null,null,null,{"$f":"IF(J$9=1,Model_Start_Date,I7+1)","v":"2019-07-01"},{"$f":"IF(K$9=1,Model_Start_Date,J7+1)","v":"2020-07-01"},{"$f":"IF(L$9=1,Model_Start_Date,K7+1)","v":"2021-07-01"},{"$f":"IF(M$9=1,Model_Start_Date,L7+1)","v":"2022-07-01"},{"$f":"IF(N$9=1,Model_Start_Date,M7+1)","v":"2023-07-01"}]
[null,null,"End Date",null,null,null,null,null,null,{"$f":"EOMONTH(J$6,MOD(Periodicity+Reporting_Month_Factor-MONTH(J$6),Periodicity))","v":"2020-06-30"},{"$f":"EOMONTH(K$6,MOD(Periodicity+Reporting_Month_Factor-MONTH(K$6),Periodicity))","v":"2021-06-30"},{"$f":"EOMONTH(L$6,MOD(Periodicity+Reporting_Month_Factor-MONTH(L$6),Periodicity))","v":"2022-06-30"},{"$f":"EOMONTH(M$6,MOD(Periodicity+Reporting_Month_Factor-MONTH(M$6),Periodicity))","v":"2023-06-30"},{"$f":"EOMONTH(N$6,MOD(Periodicity+Reporting_Month_Factor-MONTH(N$6),Periodicity))","v":"2024-06-30"}]
[null,null,"Number of Days",null,null,null,null,null,null,{"$f":"J7-J6+1","v":366},{"$f":"K7-K6+1","v":365},365,365,366]
[null,null,"Counter",null,null,null,null,null,null,{"$f":"N(I9)+1","v":1},{"$f":"N(J9)+1","v":2},3,4,5]
[]
[null,{"$f":"MAX($B$10:$B10)+1","v":1},"Timing Assumptions"]
[]
[null,null,"Data (do not change once modelling has commenced)"]
[]
[null,null,null,"Model Start Date",null,null,null,"2019-07-01"]
[]
[null,null,null,"Number of Months in a Full Period",null,null,null,12]
[]
[null,null,null,"Example Reporting Month",null,null,null,6,{"$f":"\"e.g. \"&TEXT(DATE(YEAR(Model_Start_Date)+IF(Example_Reporting_Month<MONTH(Model_Start_Date),1,0),Example_Reporting_Month+1,1)-1,\"dd-Mmm-yy\")","v":"e.g. 30-Jun-20"}]
[]
{"$rows_left_out":4}
{"sheet":"Error Checks","index":11,"n_rows":25,"n_cols":9,"rows_kept":25,"cut":false,"hidden":false,"merged":[[0,8,0,9]]}
[{"$f":"IF(ISERROR(RIGHT(CELL(\"filename\",A1),LEN(CELL(\"filename\",A1))-FIND(\"]\",CELL(\"filename\",A1)))),\n\"\",\nRIGHT(CELL(\"filename\",A1),LEN(CELL(\"filename\",A1))-FIND(\"]\",CELL(\"filename\",A1))))","v":"Error Checks"}]
[{"$f":"Model_Name","v":"Go Skills Model 22 - Revenue Part 2 End.xlsm"}]
["Navigator"]
[null,"Error Checks:",null,null,null,{"$f":"Overall_Error_Check","v":0}]
[]
[null,{"$f":"MAX($B$5:$B5)+1","v":1},"Error Checks"]
[]
[null,null,"Summary of Errors"]
[]
[null,null,null,"Assumptions"]
[]
[null,null,null,null,"Balance Sheet has no errors",null,null,null,{"$f":"HL_BS_Errors","v":0}]
[null,null,null,null,"Balance Sheet balances",null,null,null,{"$f":"HL_BS_Balance","v":0}]
[null,null,null,null,"Insolvency Check for Balance Sheet",null,null,null,{"$f":"HL_BS_Insolvency","v":0}]
[null,null,null,null,"Opening Balance Sheet has no errors",null,null,null,{"$f":"HL_Op_BS_Errors","v":0}]
[null,null,null,null,"Opening Balance Sheet balances",null,null,null,{"$f":"HL_Op_BS_Balance","v":0}]
[null,null,null,null,"Insolvency Check for Opening Balance Sheet",null,null,null,{"$f":"HL_Op_BS_Insolvency","v":0}]
[]
[]
[]
{"$rows_left_out":6}
{"sheet":"Change Log","index":12,"n_rows":13,"n_cols":11,"rows_kept":13,"cut":false,"hidden":false,"merged":[]}
[{"$f":"IF(ISERROR(RIGHT(CELL(\"filename\",A1),LEN(CELL(\"filename\",A1))-FIND(\"]\",CELL(\"filename\",A1)))),\n\"\",\nRIGHT(CELL(\"filename\",A1),LEN(CELL(\"filename\",A1))-FIND(\"]\",CELL(\"filename\",A1))))","v":"Change Log"}]
[{"$f":"Model_Name","v":"Go Skills Model 22 - Revenue Part 2 End.xlsm"}]
["Navigator"]
[null,"Error Checks:",null,null,null,{"$f":"Overall_Error_Check","v":0}]
[]
[null,{"$f":"MAX($B$5:$B5)+1","v":1},{"$f":"A1","v":"Change Log"}]
[]
[null,null,"Summary"]
[]
[null,null,null,null,null,"Date","Model Version ","Details of change","Worksheet Reference","Row, column, cell reference","Author"]
[null,null,null,null,null,"2019-07-01","Version LB1.01","I changed it","Change Log","J11","LB"]
[null,null,null,null,null,"2019-07-01","Version LB1.02","So did I.","Error Checks","I12","LB"]
[null,null,null,null,null,"2019-07-01","Version LB1.03","And me.","Navigator","A1","Dave"]